{"text_format":"1","workbook":"xlsx","n_sheets":11,"sheets":["Instructions","References","Inputs","Summary","Scope 1 - Process","Scope 1 - Combustion","Scope 2 - Electricity","Scope 3 - Electricity upstream","Scope 3 - Fuel upstream","Scope 3 - Biosolids","Scope 3 - Chemicals"],"not_rendered":{"charts":4,"images":2,"macros":1,"external_links":0,"defined_names":67,"comments":6,"pivot_tables":0},"unopened":[],"bounds":{"document_bytes":16777216,"sheet_cells":100000,"rows_first":2000,"rows_last":500,"rows_between":2000,"halvings":0,"cell_chars":16384,"cell_head_chars":4096},"cells_cut":0,"cells_raw":0,"read":"whole","date_system":"1900"}

{"sheet":"Instructions","index":0,"n_rows":59,"n_cols":4,"rows_kept":59,"cut":false,"hidden":false,"merged":[[14,1,14,11],[3,1,3,11],[13,1,13,11],[17,1,17,11],[18,1,18,11]]}
[null,"Greenhouse Gas Emissions Inventory"]
[]
[null,"About: "]
[null,"The Greenhouse Gas Emissions Inventory Tool (GHG Inventory Tool) was developed as a free and accessible tool to help utilities develop a GHG Inventory that is as accurate as possible.  The Tool is based on work done by University of Toronto under contract to City of Toronto, as revised by the OWWA/WEAO Climate Change Committee GHG Inventory Task Group.  The Tool was designed for use by Ontario water & wastewater utilities, but can be adapted for use in other jurisdictions."]
[]
[null,"Versions"]
[null,"Version #","Issue Date","Description"]
[null,"01","2023-03-10","First release for Beta Testing"]
[null,"02","2023-04-17","First official release on OWWA & WEAO websites"]
[null,"03","2023-09-14","Corrections & minor updates - changes summarized in User Guide"]
{"$rows_left_out":50}
{"sheet":"References","index":1,"n_rows":20,"n_cols":4,"rows_kept":20,"cut":false,"hidden":false,"merged":[]}
[null,"REFERENCES"]
[]
[null,"The \"Short Names\" below are used throughout the spreadsheet to trace the origin of data from literature.  Links are included on this page only, for ease of future updating.  "]
[]
[null,"Short Name","Full Name","Link"]
[null,"BEAM 2011","Biosolids Emissions Assessment Model 2011","https://ccme.ca/en/res/beam_revised_version_1.1.xls"]
[null,"BEAM 2011 User Guide","Biosolids Emissions Assessment Model 2011 User Guide","https://ccme.ca/en/res/beam_user_guide_e.pdf"]
[null,"BEAM 2022","Biosolids Emissions Assessment Model 2022","https://www.biosolidsghgs.org/"]
[null,"Canada Fuel LCA Model","Canada Fuel LCA Model","https://www.canada.ca/en/environment-climate-change/services/managing-pollution/fuel-life-cycle-assessment-model.html"]
[null,"Canada Fuel LCA Methodology","Canada Fuel LCA Model Methodology","https://publications.gc.ca/collections/collection_2020/eccc/En4-418-2020-eng.pdf"]
{"$rows_left_out":11}
{"sheet":"Inputs","index":2,"n_rows":284,"n_cols":32,"rows_kept":284,"cut":false,"hidden":false,"merged":[[281,6,281,11],[282,6,282,11],[283,6,283,11],[276,6,276,11],[277,6,277,11],[278,6,278,11],[279,6,279,11],[280,6,280,11],[271,6,271,11],[272,6,272,11],[273,6,273,11],[274,6,274,11],[275,6,275,11],[266,6,266,11],[267,6,267,11],[268,6,268,11],[269,6,269,11],[270,6,270,11],[11,3,11,5],[10,3,10,5],[9,3,9,5],[264,6,264,11],[265,6,265,11],[219,1,220,1],[219,2,220,2],[215,2,216,2],[15,9,15,12],[15,4,15,7],[215,1,216,1],[80,4,80,6],[194,5,194,7]]}
[null,"Greenhouse Gas Emissions Inventory - Inputs ",null,null,null,null,null,null,null,null,null,null,null,null,null,null,null,null,"DO NOT DELETE OR ALTER CELLS IN COLUMNS \"S\" AND BEYOND. THESE ARE USED AS INTERNAL CALCULATIONS FOR FORMATTING AND LISTS."]
[null,null,null,null,null,null,null,null,null,null,null,null,null,null,null,null,null,null,"COLUMNS \"S\" AND BEYOND DO NOT NEED TO BE PRINTED FOR AND OUTPUTS."]
[null,"LEGEND"]
[null,"Utility-Specific Data"]
[null,"Value Adopted by Utility"]
[null,"Default Input, Typical Range or Value Adapted from Literature"]
[null,"Output Calculated based on Utility-Specific data"]
[]
[null,"UTILITY-SPECIFIC DATA"]
[null,"Utility Name"]
{"$rows_left_out":275}
{"sheet":"Summary","index":3,"n_rows":95,"n_cols":19,"rows_kept":95,"cut":false,"hidden":false,"merged":[[45,12,45,14],[51,12,51,14],[51,8,51,11],[50,4,50,7],[42,8,42,11],[50,8,50,11],[45,4,45,7],[45,8,45,11],[16,1,17,1],[3,1,15,1],[18,1,27,1],[42,4,42,7],[51,4,51,7],[30,1,30,2]]}
[null,"Greenhouse Gas Emissions Inventory - Summary",null,null,null,null,null,null,null,null,null,null,null,null,null,null,null,"DO NOT DELETE OR ALTER CELLS IN COLUMNS \"R\" AND BEYOND. THESE ARE USED AS INTERNAL CALCULATIONS FOR FORMATTING AND LISTS."]
[null,null,null,null,null,null,null,null,null,null,null,null,null,null,null,null,null,"COLUMNS \"R\" AND BEYOND DO NOT NEED TO BE PRINTED FOR AND OUTPUTS."]
[null,"Detailed Breakdown Emission Source",null,"Unit","TOTAL",{"$f":"IF(WWTP1=\"\",\"\",WWTP1)","v":"WWTP1"},{"$f":"IF(WWTP2=\"\",\"\",WWTP2)","v":"WWTP2"},{"$f":"IF(WWTP3=\"\",\"\",WWTP3)","v":"WWTP3"},{"$f":"IF(WWTP4=\"\",\"\",WWTP4)","v":"WWTP4"},{"$f":"IF(WWCollection=\"\",\"\",WWCollection)","v":"Collection"},{"$f":"IF(WTP1_=\"\",\"\",WTP1_)","v":"WTP1"},{"$f":"IF(WTP2_=\"\",\"\",WTP2_)","v":"WTP2"},{"$f":"IF(WTP3_=\"\",\"\",WTP3_)","v":"WTP3"},{"$f":"IF(WTP4_=\"\",\"\",WTP4_)","v":"WTP4"},{"$f":"IF(WDistr=\"\",\"\",WDistr)","v":"Distribution"},{"$f":"IF(SuppFac=\"\",\"\",SuppFac)","v":"Supp. Facilities"}]
[null,"Scope 1","Digester Biogas Combustion ","tCO2eq/year",{"$f":"SUM(F4:I4)","v":0},{"$f":"'Scope 1 - Combustion'!G47","v":0},{"$f":"'Scope 1 - Combustion'!H47","v":0},{"$f":"'Scope 1 - Combustion'!I47","v":0},{"$f":"'Scope 1 - Combustion'!J47","v":0}]
[null,null,"Biosolids Sludge Incineration","tCO2eq/year",{"$f":"SUM(F5:I5)","v":0},{"$f":"'Scope 1 - Combustion'!G68","v":""},{"$f":"'Scope 1 - Combustion'!H68","v":""},{"$f":"'Scope 1 - Combustion'!I68","v":""},{"$f":"'Scope 1 - Combustion'!J68","v":""}]
[null,null,"Process N2O from Aerobic Treatment ","tCO2eq/year",{"$f":"SUM(F6:I6)","v":0},{"$f":"'Scope 1 - Process'!G112","v":0},{"$f":"'Scope 1 - Process'!H112","v":0},{"$f":"'Scope 1 - Process'!I112","v":0},{"$f":"'Scope 1 - Process'!J112","v":0}]
[null,null,"Process CH4 from Aerobic Treatment ","tCO2eq/year",{"$f":"SUM(F7:I7)","v":0},{"$f":"'Scope 1 - Process'!G47","v":0},{"$f":"'Scope 1 - Process'!H47","v":0},{"$f":"'Scope 1 - Process'!I47","v":0},{"$f":"'Scope 1 - Process'!J47","v":0}]
[null,null,"Fugitive N2O from Effluent discharge ","tCO2eq/year",{"$f":"SUM(F8:I8)","v":0},{"$f":"'Scope 1 - Process'!G121","v":0},{"$f":"'Scope 1 - Process'!H121","v":0},{"$f":"'Scope 1 - Process'!I121","v":0},{"$f":"'Scope 1 - Process'!J121","v":0}]
[null,null,"Fugitive CH4 from Anaerobic Digester ","tCO2eq/year",0,{"$f":"'Scope 1 - Process'!G71","v":0},{"$f":"'Scope 1 - Process'!H71","v":0},{"$f":"'Scope 1 - Process'!I71","v":0},{"$f":"'Scope 1 - Process'!J71","v":0}]
[null,null,"Fugitive CH4 from Effluent discharge ","tCO2eq/year",0,{"$f":"'Scope 1 - Process'!G56","v":0},{"$f":"'Scope 1 - Process'!H56","v":0},{"$f":"'Scope 1 - Process'!I56","v":0},{"$f":"'Scope 1 - Process'!J56","v":0}]
{"$rows_left_out":86}
{"sheet":"Scope 1 - Process","index":4,"n_rows":124,"n_cols":14,"rows_kept":124,"cut":false,"hidden":false,"merged":[[122,3,123,3],[119,3,120,3],[110,3,111,3],[99,2,99,3],[106,2,106,3],[114,2,114,3],[110,2,111,2],[119,2,120,2],[93,2,93,3],[63,1,70,1],[69,3,70,3],[78,3,79,3],[72,2,72,3],[87,2,87,3],[78,2,79,2],[73,1,79,1],[63,2,63,3],[11,2,11,3],[17,2,17,3],[23,2,23,3],[29,2,29,3],[61,6,61,8],[45,2,46,2],[49,2,49,3],[35,2,35,3],[54,3,55,3],[54,2,55,2],[45,3,46,3]]}
[null,"Scope 1 - GHG Emissions Associated with Treatment Processes",null,null,null,null,null,null,null,null,null,null,"DO NOT DELETE OR ALTER CELLS IN COLUMNS \"M\" AND BEYOND. THESE ARE USED AS INTERNAL CALCULATIONS FOR FORMATTING AND LISTS."]
[null,null,null,null,null,null,null,null,null,null,null,null,"COLUMNS \"M\" AND BEYOND DO NOT NEED TO BE PRINTED FOR AND OUTPUTS."]
[null,"WARMING GLOBAL POTENTIAL"]
[null,null,null,"Biogenic CH4 Global Warming Potential (100-year horizon)","-",null,{"$f":"Inputs!$E$198","v":27},{"$f":"Inputs!$E$198","v":27},{"$f":"Inputs!$E$198","v":27},{"$f":"Inputs!$E$198","v":27},{"$f":"Inputs!$I$198","v":"AR4: IPCC 2007, Table 2.14, AR5: IPCC 2013, Table 8.7, AR6: IPCC 2021, Table 7.15"}]
[null,null,null,"N2O Global Warming Potential (100-year horizon)","-",null,{"$f":"Inputs!$E$200","v":273},{"$f":"Inputs!$E$200","v":273},{"$f":"Inputs!$E$200","v":273},{"$f":"Inputs!$E$200","v":273},{"$f":"Inputs!$I$200","v":"AR4: IPCC 2007, Table 2.14, AR5: IPCC 2013, Table 8.7, AR6: IPCC 2021, Table 7.17"}]
[]
[null,"METHANE EMISSIONS FROM DOMESTIC WASTEWATER"]
[null,"Methodology: The following five steps were adapted from the 2019 Refinement of the IPCC Guidelines, Volume 5, Chapters 4 and 6."]
[]
[null,"Step 1 -","Estimate the amount of organic material in kgBOD/year in the wastewater influent, and the bypass and effluent discharged to the aquatic environment"]
{"$rows_left_out":115}
{"sheet":"Scope 1 - Combustion","index":5,"n_rows":128,"n_cols":18,"rows_kept":128,"cut":false,"hidden":false,"merged":[[115,2,115,3],[116,5,116,7],[104,2,104,3],[71,2,71,3],[8,2,8,4],[21,2,21,4],[33,2,33,4],[93,2,93,3],[82,2,82,3],[50,2,50,3],[59,2,59,3],[120,8,120,17],[13,10,13,17],[23,10,23,17],[39,10,39,17],[118,8,118,17]]}
[null,"Scope 1 - GHG Emissions associated with Combustion"]
[]
[null,"WARMING GLOBAL POTENTIAL"]
[null,null,null,"Biogenic CH4 Global Warming Potential (100-year horizon)","-",null,{"$f":"Inputs!$E$198","v":27},{"$f":"Inputs!$E$198","v":27},{"$f":"Inputs!$E$198","v":27},{"$f":"Inputs!$E$198","v":27},{"$f":"Inputs!$I$198","v":"AR4: IPCC 2007, Table 2.14, AR5: IPCC 2013, Table 8.7, AR6: IPCC 2021, Table 7.15"}]
[null,null,null,"N2O Global Warming Potential (100-year horizon)","-",null,{"$f":"Inputs!$E$200","v":273},{"$f":"Inputs!$E$200","v":273},{"$f":"Inputs!$E$200","v":273},{"$f":"Inputs!$E$200","v":273},{"$f":"Inputs!$I$200","v":"AR4: IPCC 2007, Table 2.14, AR5: IPCC 2013, Table 8.7, AR6: IPCC 2021, Table 7.17"}]
[]
[null,"DIGESTER BIOGAS COMBUSTION EMISSIONS"]
[null,"Step 1 -","Estimate the emission from digester gas combustion in boilers",null,null,null,null,null,null,null,"Reference/Source"]
[null,null,"EDG,boiler  = ((1-εCH4 )* fCH4 * dboiler * VDG)*GWPCH4 + (EFN2O * dboiler * VDG)*GWPN2O",null,null,null,null,null,null,null,"Adapted from the Canadian Clean Fuel Standard – Fuel LCA Methodology report (Appendix D page 152) "]
[null,null,null,null,"Unit","TOTAL",{"$f":"IF(WWTP1=\"\",\"\",WWTP1)","v":"WWTP1"},{"$f":"IF(WWTP2=\"\",\"\",WWTP2)","v":"WWTP2"},{"$f":"IF(WWTP3=\"\",\"\",WWTP3)","v":"WWTP3"},{"$f":"IF(WWTP4=\"\",\"\",WWTP4)","v":"WWTP4"}]
{"$rows_left_out":119}
{"sheet":"Scope 2 - Electricity","index":6,"n_rows":9,"n_cols":18,"rows_kept":9,"cut":false,"hidden":false,"merged":[[4,2,4,3]]}
[null,"Scope 2 - GHG Emissions associate with Electricity Consumption"]
[]
[null,"ELECTRICITY COMSUMPTION EMISSIONS"]
[null,"Step 1 -","Estimate the emissions associated with electricity consumption on-site"]
[null,null,"Eelec = EFelec * Velec"]
[null,null,null,null,"Unit","TOTAL",{"$f":"IF(WWTP1=\"\",\"\",WWTP1)","v":"WWTP1"},{"$f":"IF(WWTP2=\"\",\"\",WWTP2)","v":"WWTP2"},{"$f":"IF(WWTP3=\"\",\"\",WWTP3)","v":"WWTP3"},{"$f":"IF(WWTP4=\"\",\"\",WWTP4)","v":"WWTP4"},{"$f":"IF(WWCollection=\"\",\"\",WWCollection)","v":"Collection"},{"$f":"IF(WTP1_=\"\",\"\",WTP1_)","v":"WTP1"},{"$f":"IF(WTP2_=\"\",\"\",WTP2_)","v":"WTP2"},{"$f":"IF(WTP3_=\"\",\"\",WTP3_)","v":"WTP3"},{"$f":"IF(WTP4_=\"\",\"\",WTP4_)","v":"WTP4"},{"$f":"IF(WDistr=\"\",\"\",WDistr)","v":"Distribution"},{"$f":"IF(SuppFac=\"\",\"\",SuppFac)","v":"Supp. Facilities"},"Reference/Source"]
[null,null,"EFelec","Ontario Electricity Generation EF","gCO2eq/kWh",null,{"$f":"Inputs!$E$256","v":28},{"$f":"Inputs!$E$256","v":28},{"$f":"Inputs!$E$256","v":28},{"$f":"Inputs!$E$256","v":28},{"$f":"Inputs!$E$256","v":28},{"$f":"Inputs!$E$256","v":28},{"$f":"Inputs!$E$256","v":28},{"$f":"Inputs!$E$256","v":28},{"$f":"Inputs!$E$256","v":28},{"$f":"Inputs!$E$256","v":28},{"$f":"Inputs!$E$256","v":28},{"$f":"Inputs!G256","v":"NIR 2022, Part 3, Table A13-7"}]
[null,null,"Velec","Annual Electricity Consumption","kWh/year",null,{"$f":"Inputs!E75","v":0},{"$f":"Inputs!F75","v":0},{"$f":"Inputs!G75","v":0},{"$f":"Inputs!H75","v":0},{"$f":"Inputs!I75","v":0},{"$f":"Inputs!J75","v":0},{"$f":"Inputs!K75","v":0},{"$f":"Inputs!L75","v":0},{"$f":"Inputs!M75","v":0},{"$f":"Inputs!N75","v":0},{"$f":"Inputs!O75","v":0},{"$f":"Inputs!Q75","v":"Utility-data source"}]
[null,null,"Eelec","Electricity Consumption Emissions","tCO2eq/year",{"$f":"SUM(G9:Q9)","v":0},{"$f":"G8*G7/1000000","v":0},0,0,0,0,0,0,0,0,0,0]

{"sheet":"Scope 3 - Electricity upstream","index":7,"n_rows":11,"n_cols":18,"rows_kept":11,"cut":false,"hidden":false,"merged":[[4,2,4,3]]}
[null,"Scope 3 - GHG Upstream Emissions associated with Electricity"]
[]
[null,"ELECTRICITY UPSTREAM EMISSIONS-Using the Fuel LCA Model electricity patch - National Inventory "]
[null,"Step 1 -","Estimate the emissions associated with upstream electricity "]
[null,null,"Eup-elec = EFup-elec * Velec"]
[null,null,null,null,"Unit","TOTAL",{"$f":"IF(WWTP1=\"\",\"\",WWTP1)","v":"WWTP1"},{"$f":"IF(WWTP2=\"\",\"\",WWTP2)","v":"WWTP2"},{"$f":"IF(WWTP3=\"\",\"\",WWTP3)","v":"WWTP3"},{"$f":"IF(WWTP4=\"\",\"\",WWTP4)","v":"WWTP4"},{"$f":"IF(WWCollection=\"\",\"\",WWCollection)","v":"Collection"},{"$f":"IF(WTP1_=\"\",\"\",WTP1_)","v":"WTP1"},{"$f":"IF(WTP2_=\"\",\"\",WTP2_)","v":"WTP2"},{"$f":"IF(WTP3_=\"\",\"\",WTP3_)","v":"WTP3"},{"$f":"IF(WTP4_=\"\",\"\",WTP4_)","v":"WTP4"},{"$f":"IF(WDistr=\"\",\"\",WDistr)","v":"Distribution"},{"$f":"IF(SuppFac=\"\",\"\",SuppFac)","v":"Supp. Facilities"},"Reference/Source"]
[null,null,"EFelec","Ontario Electricity Generation EF","gCO2eq/kWh",null,{"$f":"Inputs!$E$256","v":28},{"$f":"Inputs!$E$256","v":28},{"$f":"Inputs!$E$256","v":28},{"$f":"Inputs!$E$256","v":28},{"$f":"Inputs!$E$256","v":28},{"$f":"Inputs!$E$256","v":28},{"$f":"Inputs!$E$256","v":28},{"$f":"Inputs!$E$256","v":28},{"$f":"Inputs!$E$256","v":28},{"$f":"Inputs!$E$256","v":28},{"$f":"Inputs!$E$256","v":28},{"$f":"Inputs!G256","v":"NIR 2022, Part 3, Table A13-7"}]
[null,null,null,"Ontario LCA-based Grid Intensity Factor","gCO2eq/kWh",null,{"$f":"Inputs!$E$257","v":50.36},{"$f":"Inputs!$E$257","v":50.36},{"$f":"Inputs!$E$257","v":50.36},{"$f":"Inputs!$E$257","v":50.36},{"$f":"Inputs!$E$257","v":50.36},{"$f":"Inputs!$E$257","v":50.36},{"$f":"Inputs!$E$257","v":50.36},{"$f":"Inputs!$E$257","v":50.36},{"$f":"Inputs!$E$257","v":50.36},{"$f":"Inputs!$E$257","v":50.36},{"$f":"Inputs!$E$257","v":50.36},{"$f":"Inputs!G257","v":"Canada Fuel LCA Methodology"}]
[null,null,"EFup-elec","Ontario Upstream Electricity Emission Factor ","gCO2eq/kWh",null,{"$f":"G8-G7","v":22.36},22.36,22.36,22.36,22.36,22.36,22.36,22.36,22.36,22.36,22.36]
[null,null,"Velec","Annual Electricity Consumption","kWh/year",null,{"$f":"Inputs!E75","v":0},{"$f":"Inputs!F75","v":0},{"$f":"Inputs!G75","v":0},{"$f":"Inputs!H75","v":0},{"$f":"Inputs!I75","v":0},{"$f":"Inputs!J75","v":0},{"$f":"Inputs!K75","v":0},{"$f":"Inputs!L75","v":0},{"$f":"Inputs!M75","v":0},{"$f":"Inputs!N75","v":0},{"$f":"Inputs!O75","v":0},{"$f":"Inputs!Q75","v":"Utility-data source"}]
{"$rows_left_out":2}
{"sheet":"Scope 3 - Fuel upstream","index":8,"n_rows":54,"n_cols":18,"rows_kept":54,"cut":false,"hidden":false,"merged":[[4,2,4,3],[13,2,13,3],[31,2,31,3],[46,8,46,17],[47,8,47,17],[43,2,43,3],[44,5,44,7],[22,2,22,3]]}
[null,"Scope 3 - GHG Upstream Emissions associated with Fuel"]
[]
[null,"NATURAL GAS UPSTREAM EMISSIONS"]
[null,"Step 1 -","Estimate the natural gas upstream emissions",null,null,null,null,null,null,null,null,null,null,null,null,null,null,"Reference/Source"]
[null,null,"U NG = EFu * HHV * VNG",null,null,null,null,null,null,null,null,null,null,null,null,null,null,"Adapted from MECP ON.20"]
[null,null,null,null,"Unit","TOTAL",{"$f":"IF(WWTP1=\"\",\"\",WWTP1)","v":"WWTP1"},{"$f":"IF(WWTP2=\"\",\"\",WWTP2)","v":"WWTP2"},{"$f":"IF(WWTP3=\"\",\"\",WWTP3)","v":"WWTP3"},{"$f":"IF(WWTP4=\"\",\"\",WWTP4)","v":"WWTP4"},{"$f":"IF(WWCollection=\"\",\"\",WWCollection)","v":"Collection"},{"$f":"IF(WTP1_=\"\",\"\",WTP1_)","v":"WTP1"},{"$f":"IF(WTP2_=\"\",\"\",WTP2_)","v":"WTP2"},{"$f":"IF(WTP3_=\"\",\"\",WTP3_)","v":"WTP3"},{"$f":"IF(WTP4_=\"\",\"\",WTP4_)","v":"WTP4"},{"$f":"IF(WDistr=\"\",\"\",WDistr)","v":"Distribution"},{"$f":"IF(SuppFac=\"\",\"\",SuppFac)","v":"Supp. Facilities"}]
[null,null,"HHVNG","Natural Gas Higher Heating Value (HHV)","GJ/m3",null,{"$f":"Inputs!$E$232","v":3.7999999999999999E-2},{"$f":"Inputs!$E$232","v":3.7999999999999999E-2},{"$f":"Inputs!$E$232","v":3.7999999999999999E-2},{"$f":"Inputs!$E$232","v":3.7999999999999999E-2},{"$f":"Inputs!$E$232","v":3.7999999999999999E-2},{"$f":"Inputs!$E$232","v":3.7999999999999999E-2},{"$f":"Inputs!$E$232","v":3.7999999999999999E-2},{"$f":"Inputs!$E$232","v":3.7999999999999999E-2},{"$f":"Inputs!$E$232","v":3.7999999999999999E-2},{"$f":"Inputs!$E$232","v":3.7999999999999999E-2},{"$f":"Inputs!$E$232","v":3.7999999999999999E-2},{"$f":"Inputs!G232","v":"MECP ON.20"}]
[null,null,"EFu","Natural Gas Carbon Intensity - Cradle to consumer (CTCG)","gCO2eq/MJ",null,{"$f":"Inputs!$E$233","v":15},{"$f":"Inputs!$E$233","v":15},{"$f":"Inputs!$E$233","v":15},{"$f":"Inputs!$E$233","v":15},{"$f":"Inputs!$E$233","v":15},{"$f":"Inputs!$E$233","v":15},{"$f":"Inputs!$E$233","v":15},{"$f":"Inputs!$E$233","v":15},{"$f":"Inputs!$E$233","v":15},{"$f":"Inputs!$E$233","v":15},{"$f":"Inputs!$E$233","v":15},{"$f":"Inputs!G233","v":"Canada Fuel LCA Methodology, Table 1 p.119 "}]
[null,null,"VNG","Natural Gas Annual Consumption","m3/year",null,{"$f":"Inputs!E64","v":0},{"$f":"Inputs!F64","v":0},{"$f":"Inputs!G64","v":0},{"$f":"Inputs!H64","v":0},{"$f":"Inputs!I64","v":0},{"$f":"Inputs!J64","v":0},{"$f":"Inputs!K64","v":0},{"$f":"Inputs!L64","v":0},{"$f":"Inputs!M64","v":0},{"$f":"Inputs!N64","v":0},{"$f":"Inputs!O64","v":0},{"$f":"Inputs!Q64","v":"Utility-data source"}]
[null,null,"UNG","Natural Gas Upstream Emissions","tCO2eq/year",{"$f":"SUM(G10:Q10)","v":0},{"$f":"G7*G9*G8/1000","v":0},{"$f":"H7*H9*H8/1000","v":0},0,0,0,0,0,0,0,0,0]
{"$rows_left_out":45}
{"sheet":"Scope 3 - Biosolids","index":9,"n_rows":22,"n_cols":10,"rows_kept":22,"cut":false,"hidden":false,"merged":[[4,6,4,8]]}
[null,"Scope 3 - GHG Emissions associated with Biosolids Management"]
[]
[null,"OFF-SITE BIOSOLIDS MANAGEMENT EMISSIONS"]
[null,"Step 1 -","Choose inventory approach for biosolids"]
[null,null,"Inventory approach for biosolids",null,null,null,{"$f":"Inputs!$E$81","v":"BEAM 2022"}]
[]
[null,"Step 2-","Estimate the emissions associated with biosolids management (BEAM)"]
[null,null,null,"Unit Process",null,null,{"$f":"IF(WWTP1=\"\",\"\",WWTP1)","v":"WWTP1"},{"$f":"IF(WWTP2=\"\",\"\",WWTP2)","v":"WWTP2"},{"$f":"IF(WWTP3=\"\",\"\",WWTP3)","v":"WWTP3"},{"$f":"IF(WWTP4=\"\",\"\",WWTP4)","v":"WWTP4"}]
[null,null,null,"Alkaline Stabilization","tCO2eq/year",null,{"$f":"IF($G$5=Inputs!$T$80,Inputs!E85,IF($G$5=Inputs!$T$81,Inputs!E94,\"\"))","v":0},{"$f":"IF($G$5=Inputs!$T$80,Inputs!F85,IF($G$5=Inputs!$T$81,Inputs!F94,\"\"))","v":0},{"$f":"IF($G$5=Inputs!$T$80,Inputs!G85,IF($G$5=Inputs!$T$81,Inputs!G94,\"\"))","v":0},{"$f":"IF($G$5=Inputs!$T$80,Inputs!H85,IF($G$5=Inputs!$T$81,Inputs!H94,\"\"))","v":0}]
[null,null,null,"Composting","tCO2eq/year",null,{"$f":"IF($G$5=Inputs!$T$80,Inputs!E86,IF($G$5=Inputs!$T$81,Inputs!E95,\"\"))","v":0},{"$f":"IF($G$5=Inputs!$T$80,Inputs!F86,IF($G$5=Inputs!$T$81,Inputs!F95,\"\"))","v":0},{"$f":"IF($G$5=Inputs!$T$80,Inputs!G86,IF($G$5=Inputs!$T$81,Inputs!G95,\"\"))","v":0},{"$f":"IF($G$5=Inputs!$T$80,Inputs!H86,IF($G$5=Inputs!$T$81,Inputs!H95,\"\"))","v":0}]
{"$rows_left_out":13}
{"sheet":"Scope 3 - Chemicals","index":10,"n_rows":166,"n_cols":19,"rows_kept":166,"cut":false,"hidden":false,"merged":[[5,2,5,3],[74,2,74,3]]}
[null,"Scope 3 - GHG Emissions associated with Chemical Consumption",null,null,null,null,null,null,null,null,null,null,null,null,null,null,null,null,"DO NOT DELETE OR ALTER CELLS IN COLUMNS \"S\" AND BEYOND. THESE ARE USED AS INTERNAL CALCULATIONS FOR FORMATTING AND LISTS."]
[null,null,null,null,null,null,null,null,null,null,null,null,null,null,null,null,null,null,"COLUMNS \"S\" AND BEYOND DO NOT NEED TO BE PRINTED FOR AND OUTPUTS."]
[null,"Note:","Please refer to the User Guide for guidance on approaches for estimating emissions from chemicals"]
[null,"CHEMICAL CONSUMPTION EMISSIONS"]
[null,"Step 1 -","Estimate the emissions associated with chemical production",null,null,null,null,null,null,null,null,null,null,null,null,null,null,null,{"$f":"TRUE","v":true}]
[null,null,"Echem = EFchem * Mchem",null,null,null,null,null,null,null,null,null,null,null,null,null,null,null,{"$f":"TRUE","v":true}]
[null,null,null,null,"Unit","Input Value","Reference/Source",null,null,null,null,null,null,null,null,null,null,null,{"$f":"TRUE","v":true}]
[null,null,"EFchem","Chemicals Emission Factors"]
[null,null,null,{"$f":"Inputs!C110","v":"Chemical 1"},"kgCO2eq/kg",{"$f":"Inputs!E265","v":0},{"$f":"Inputs!G265","v":"Utility-data source"},null,null,null,null,null,null,null,null,null,null,null,{"$f":"Inputs!T110","v":false}]
[null,null,null,{"$f":"Inputs!C111","v":"Chemical 2"},"kgCO2eq/kg",{"$f":"Inputs!E266","v":0},{"$f":"Inputs!G266","v":"Utility-data source"},null,null,null,null,null,null,null,null,null,null,null,{"$f":"Inputs!T111","v":false}]
{"$rows_left_out":156}